Posting in the Magento forums has been disabled pending the implementation of a new and improved forum solution which should better serve the community.

For new questions please post at magento.stackexchange.com, the community-run support site for the Magento community. We will be providing updates on the new forum solution soon. For questions or concerns please email community@magento.com.

Magento Forum

Updating to 1.3.0 with diff
 
ZeusSOM
Member
 
Total Posts:  69
Joined:  2009-01-25
 

The first two went fine then with the latest update I get the following (this is not all of it because I stopped it half way through:

patching file app/Mage.php
patching file app/locale/en_US/Mage_Catalog.csv
patching file app/locale/en_US/template/email/account_new_confirmation.html
Hunk #1 FAILED at 1.
1 out of 1 hunk FAILED—saving rejects to file app/locale/en_US/template/email/account_new_confirmation.html.rej
patching file app/locale/en_US/template/email/admin_password_new.html
Hunk #1 FAILED at 24.
1 out of 1 hunk FAILED—saving rejects to file app/locale/en_US/template/email/admin_password_new.html.rej
patching file app/locale/en_US/template/email/wishlist_share.html
Hunk #1 FAILED at 20.
1 out of 1 hunk FAILED—saving rejects to file app/locale/en_US/template/email/wishlist_share.html.rej
patching file app/locale/en_US/template/email/newsletter_subscr_confirm.html
Hunk #1 FAILED at 25.
1 out of 1 hunk FAILED—saving rejects to file app/locale/en_US/template/email/newsletter_subscr_confirm.html.rej
patching file app/locale/en_US/template/email/account_new_confirmed.html
Hunk #1 FAILED at 21.
1 out of 1 hunk FAILED—saving rejects to file app/locale/en_US/template/email/account_new_confirmed.html.rej
patching file app/locale/en_US/template/email/account_new.html
Hunk #1 FAILED at 21.
1 out of 1 hunk FAILED—saving rejects to file app/locale/en_US/template/email/account_new.html.rej
patching file app/locale/en_US/template/email/password_new.html
Hunk #1 FAILED at 21.
1 out of 1 hunk FAILED—saving rejects to file app/locale/en_US/template/email/password_new.html.rej
can’t find file to patch at input line 192
Perhaps you used the wrong -p or --strip option?
The text leading up to this was:
--------------------------
|Index: app/design/frontend/default/iphone/template/downloadable/customer/products/list.phtml
|===================================================================
|--- app/design/frontend/default/iphone/template/downloadable/customer/products/list.phtml (revision 37004)
|+++ app/design/frontend/default/iphone/template/downloadable/customer/products/list.phtml (revision 37005)
--------------------------
File to patch:

ZeusSOM
Jr. Member

Total Posts:  28
Joined:  2009-01-25
Ignore user

This comes up on the site afterwards:

Fatal error: Cannot redeclare Mage_Page_Block_Template_Links::removeLinkByUrl() in /home/science1/public_html/somstore/app/code/core/Mage/Page/Block/Template/Links.php on line 135

 
Magento Community Magento Community
Magento Community
Magento Community
 
ZeusSOM
Member
 
Total Posts:  69
Joined:  2009-01-25
 

Am I really the only one?

 
Magento Community Magento Community
Magento Community
Magento Community
Magento Community
Magento Community
Back to top